Page 2 of 25 FirstFirst 123456712 ... LastLast
Results 21 to 40 of 489
  1.    #21  
    Patch now up everyone
  2.    #22  
    evrything has been done on my pre and it works

    EDIT: make that 2 pres. i just did my brothers as well
    Last edited by fritos1406; 08/14/2009 at 08:40 PM.
  3. #23  
    root@castle:/# quilt push enable-browser-downloads110.patch
    Applying patch /opt/src/patches/enable-browser-downloads110.patch
    patching file usr/palm/applications/com.palm.app.browser/app/controllers/global_code.jsjsjs
    Hunk #1 FAILED at 1449.
    Hunk #2 FAILED at 2289.
    Hunk #3 FAILED at 2331.
    3 out of 3 hunks FAILED -- rejects in file usr/palm/applications/com.palm.app.browser/app/controllers/global_code.jsjsjs
    patching file usr/palm/applications/com.palm.app.browser/app/views/download/download-container.html
    Hunk #1 FAILED at 1.
    1 out of 1 hunk FAILED -- rejects in file usr/palm/applications/com.palm.app.browser/app/views/download/download-container.html
    patching file usr/palm/applications/com.palm.app.browser/app/views/page/page-scene.html
    Hunk #1 FAILED at 16.
    1 out of 1 hunk FAILED -- rejects in file usr/palm/applications/com.palm.app.browser/app/views/page/page-scene.html
    patching file usr/palm/applications/com.palm.app.browser/sources.json
    Hunk #1 FAILED at 1.
    1 out of 1 hunk FAILED -- rejects in file usr/palm/applications/com.palm.app.browser/sources.json
    Patch /opt/src/patches/enable-browser-downloads110.patch does not apply (enforce with -f)
    root@castle:/#


    ????
    Last edited by Jtemple33; 08/14/2009 at 09:39 PM.
  4. willsurg's Avatar
    Posts
    65 Posts
    Global Posts
    66 Global Posts
    #24  
    hey thanks, I got to this before was taken down. I had tried the patch in the past and was not working for me but this worked perfectly. Many thanks!
  5.    #25  
    i just edited the patch can someone test it to see if it works now?
  6. Ikyo's Avatar
    Posts
    290 Posts
    Global Posts
    292 Global Posts
    #26  
    The patch worked okay for me
    Last edited by Ikyo; 08/14/2009 at 10:19 PM. Reason: Patch works...
  7. #27  
    so can I use the patch that's on the first page?
  8.    #28  
    yes its been edited already
  9. #29  
    Sorry no go here. I get the error "No patches in series".

    Man I really need this to work so I can view PDF's from a web page.

    HELP!!!
    Commodore Pet, Commodore 64&128, Amiga 4000, PC-7, Ubuntu, Treo 650. Treo 755p,Sprint Palm Pre Plus 2.2.4,2 Sprint Pre2 2.2.4, TouchPad 32gig.
  10. #30  
    yeah, works like a champ now.
    i've used it to dl a pdf file as a test.
    what do you guys use it extensively for?
  11. #31  
    good, going to try it now
  12.    #32  
    Sorry no go here. I get the error "No patches in series".

    Man I really need this to work so I can view PDF's from a web page.

    HELP!!!
    try copying the patch into the ~/browser/enable-browser-downloads110.patch directory
  13. Ikyo's Avatar
    Posts
    290 Posts
    Global Posts
    292 Global Posts
    #33  
    craftsman: Don't do the mv portion. Do quilt import <where you downloaded the patch>
  14. #34  
    Well I need it to view PDF's via the web. The city that I work for has numerous links to PDF's docs. Check out City of Northglenn Public Meeting Records

    and try to click on any of the links. No go on a basic Pre.
    Commodore Pet, Commodore 64&128, Amiga 4000, PC-7, Ubuntu, Treo 650. Treo 755p,Sprint Palm Pre Plus 2.2.4,2 Sprint Pre2 2.2.4, TouchPad 32gig.
  15.    #35  
    okay i edited the "mv" portion part and change it to "quilt import" so evrything could be copied and pasted inside the quote boxes. Thanks Ikyo
  16. #36  
    Still no go. Now I get the error No file to patch. Skipping patch
    Commodore Pet, Commodore 64&128, Amiga 4000, PC-7, Ubuntu, Treo 650. Treo 755p,Sprint Palm Pre Plus 2.2.4,2 Sprint Pre2 2.2.4, TouchPad 32gig.
  17.    #37  
    try re-doing the steps again starting from downloading the patch
  18. #38  
    Quote Originally Posted by craftsman View Post
    Still no go. Now I get the error No file to patch. Skipping patch
    same here, tried the whole process from the beginning
  19. #39  
    well didn't get it to work, darn I usually get them working on the first try, well don't know what happened.....at first it gave me the same error as craftsman but I repeated the 3rd and 4th steps and it appeared to work, rebooted and when I hit download it sent me straight to the streaming.
  20.    #40  
    u can try moving the patch into the "opt/src/modification/browser/ " directory then from there import it to the patches dir. and run quilt
Page 2 of 25 FirstFirst 123456712 ... LastLast

Tags for this Thread

Posting Permissions